New issue
Advanced search Search tips
Note: Color blocks (like or ) mean that a user may not be available. Tooltip shows the reason.
Starred by 1 user

Issue metadata

Status: Assigned
Owner:
Cc:
Components:
EstimatedDays: ----
NextAction: ----
OS: ----
Pri: 3
Type: Bug



Sign in to add a comment

nami-release failed cheets_CameraOrientation

Project Member Reported by evgreen@chromium.org, Aug 1

Issue description

The following build failed:

https://cros-goldeneye.corp.google.com/chromeos/healthmonitoring/buildDetails?buildbucketId=8939401671343940736

It's possible that this was a downstream effect of some network infrastructure issues, but it still seems like the test should not abort in such a way.

Info below:
	START	cheets_CameraOrientation	cheets_CameraOrientation	timestamp=1533135143	localtime=Aug 01 07:52:23	
		FAIL	cheets_CameraOrientation	cheets_CameraOrientation	timestamp=1533135269	localtime=Aug 01 07:54:29	Unhandled JsonRPCError: JsonRPC Error code: 0, Message: java.lang.NullPointerException: Attempt to invoke virtual method 'boolean android.view.accessibility.AccessibilityNodeInfo.isVisibleToUser()' on a null object reference
  Traceback (most recent call last):
    File "/usr/local/autotest/common_lib/test.py", line 831, in _call_test_function
      return func(*args, **dargs)
    File "/usr/local/autotest/common_lib/test.py", line 495, in execute
      dargs)
    File "/usr/local/autotest/common_lib/test.py", line 362, in _call_run_once_with_retry
      postprocess_profiled_run, args, dargs)
    File "/usr/local/autotest/common_lib/test.py", line 400, in _call_run_once
      self.run_once(*args, **dargs)
    File "/usr/local/autotest/tests/cheets_CameraOrientation/cheets_CameraOrientation.py", line 54, in run_once
      textContains='[01]').wait.exists(timeout=20000)
    File "/usr/local/autotest/deps/uiautomator/uiautomator/__init__.py", line 74, in __call__
      return self.func(*args, **kwargs)
    File "/usr/local/autotest/deps/uiautomator/uiautomator/__init__.py", line 1045, in _wait
      return method(self.selector, timeout)
    File "/usr/local/autotest/deps/uiautomator/uiautomator/__init__.py", line 433, in wrapper
      return _method_obj(*args, **kwargs)
    File "/usr/local/autotest/deps/uiautomator/uiautomator/__init__.py", line 132, in __call__
      "%s: %s" % (jsonresult["error"]["data"]["exceptionTypeName"], jsonresult["error"]["message"])
  JsonRPCError: JsonRPC Error code: 0, Message: java.lang.NullPointerException: Attempt to invoke virtual method 'boolean android.view.accessibility.AccessibilityNodeInfo.isVisibleToUser()' on a null object reference
	END FAIL	cheets_CameraOrientation	cheets_CameraOrientation	timestamp=1533135269	localtime=Aug 01 07:54:29	
 
Cc: yusukes@chromium.org yhanada@chromium.org risan@chromium.org
Components: -Infra>Client>ChromeOS>Test Platform>Apps>ARC
Owner: phshah@chromium.org
Status: Assigned (was: Untriaged)
As a rule, test failures (including test bugs) can (should) be blamed
on the product, not the infrastructure.

This being a cheets test failure, we'll need to pull in the ARC++ constable.

Sign in to add a comment