New issue
Advanced search Search tips
Starred by 1 user
Status: Archived
Owner:
Closed: Sep 20
Cc:
Components:
EstimatedDays: ----
NextAction: ----
OS: Android , Chrome
Pri: 1
Type: Bug

Blocking:
issue 762641



Sign in to add a comment
HWTest timing out in relm-release/eve-release builds
Project Member Reported by kitching@google.com, Aug 28 Back to list
These two builds time out in HWTest section:

https://luci-milo.appspot.com/buildbot/chromeos/relm-release/1438
(1440 failed due to lack of BVT duts)
(1439 built successfully)
https://luci-milo.appspot.com/buildbot/chromeos/relm-release/1441

They're both failing completely different tests, but they all seem ARC-related.

If this is not an infra issue, please reassign.


[1438]
  cheets_SettingsBridge_SERVER_JOB          [ FAILED ]
  cheets_SettingsBridge_SERVER_JOB            ABORT: 
  graphics_Idle.arc                         [ FAILED ]
  graphics_Idle.arc                           ABORT: None
  graphics_Idle.arc                         [ FAILED ]
  graphics_Idle.arc                           ABORT: None
  desktopui_ExitOnSupervisedUserCrash.arc   [ FAILED ]
  desktopui_ExitOnSupervisedUserCrash.arc     ABORT: None
  desktopui_ExitOnSupervisedUserCrash.arc   [ FAILED ]
  desktopui_ExitOnSupervisedUserCrash.arc     ABORT: None

  Suite timings:
  Downloads started at 2017-08-26 20:26:41
  Payload downloads ended at 2017-08-26 20:26:44
  Suite started at 2017-08-26 20:27:01
  Artifact downloads ended (at latest) at 2017-08-26 20:27:04
  Testing started at 2017-08-26 20:55:35
  Testing ended at 9999-12-31 23:59:59.999999
   08-26-2017 [23:31:43] Attempting to display pool info: bvt


[1441]
  cheets_CTS_N.CtsAccountManagerTestCases   [ FAILED ]
  cheets_CTS_N.CtsAccountManagerTestCases     ABORT: None
  cheets_GTS.GtsNetTestCases                [ FAILED ]
  cheets_GTS.GtsNetTestCases                  ABORT: None

  Suite timings:
  Downloads started at 2017-08-27 20:26:39
  Payload downloads ended at 2017-08-27 20:26:41
  Suite started at 2017-08-27 20:27:24
  Artifact downloads ended (at latest) at 2017-08-27 20:27:26
  Testing started at 2017-08-27 21:02:55
  Testing ended at 9999-12-31 23:59:59.999999
   08-27-2017 [23:32:45] Attempting to display pool info: bvt
 
Labels: -Pri-3 M-63 Pri-1
Status: Assigned
This is also happening on eve and blocking chrome-sdk roll. Bumping to P1.

pprabhu@, could you please look into this, or find the right owner?
Summary: HWTest timing out in relm-release/eve-release builds (was: HWTest timing out in relm-release builds)
Here is the log

https://uberchromegw.corp.google.com/i/chromeos/builders/eve-release/builds/911/steps/HWTest%20%5Bbvt-arc%5D/logs/stdio

Suite job                                 [ FAILED ]
  Suite job                                   ABORT: 
  cheets_CTS_N.CtsAccountManagerTestCases   [ FAILED ]
  cheets_CTS_N.CtsAccountManagerTestCases     FAIL: Unhandled AutoservSSHTimeout: ('ssh timed out', * Command: 
  cheets_CTS_N.CtsAccountManagerTestCases   [ PASSED ]
  cheets_CTS_N.CtsAccelerationTestCases     [ PASSED ]
  cheets_GTS.GtsPlacementTestCases          [ PASSED ]
  cheets_CTS_N.CtsAppUsageHostTestCases     [ PASSED ]
  cheets_CTS_N.CtsDramTestCases             [ PASSED ]
  cheets_GTS.GtsNetTestCases                [ PASSED ]
  cheets_StartAndroid.stress                [ PASSED ]
  cheets_ContainerSmokeTest                 [ FAILED ]
  cheets_ContainerSmokeTest                   FAIL: Autotest client terminated unexpectedly: DUT is no longer pingable, it may have rebooted or hung.
  cheets_LoginScreen                        [ PASSED ]
  cheets_NotificationTest                   [ PASSED ]
  cheets_DownloadsFilesystem                [ FAILED ]
  cheets_DownloadsFilesystem                  FAIL: Autotest client terminated unexpectedly: DUT is no longer pingable, it may have rebooted or hung.
  security_NetworkListeners                 [ PASSED ]
  cheets_SELinuxTest                        [ PASSED ]
  cheets_KeyboardTest                       [ PASSED ]
  graphics_Idle.arc                         [ PASSED ]
  desktopui_ExitOnSupervisedUserCrash.arc   [ PASSED ]
  cheets_CTS_N.CtsAppUsageHostTestCases     [ PASSED ]
  cheets_CTS_N.CtsAppUsageHostTestCases       retry_count: 1
  cheets_CTS_N.CtsAccelerationTestCases     [ PASSED ]
  cheets_CTS_N.CtsAccelerationTestCases       retry_count: 1
  cheets_GTS.GtsAdminTestCases              [ PASSED ]
  cheets_GTS.GtsAdminTestCases                retry_count: 1
  telemetry_LoginTest.arc                   [ PASSED ]
  telemetry_LoginTest.arc                     retry_count: 1
  cheets_SettingsBridge                     [ PASSED ]
  cheets_SettingsBridge                       retry_count: 1
Cc: seobrien@chromium.org
Blocking: 762641
Comment 5 Deleted
Comment 6 Deleted
Cc: -seobrien@chromium.org
Status: Archived
This is an incident report that seems to have since subsided (I guess) and this bug doesn't have any further diagnostic information.
Sign in to add a comment